*HEADING
cubit(meshTemplateFull1.inp): 05/26/2013: 20:26:22
version: 13.2
**
********************************** P A R T S **********************************
*PART, NAME=Part-Default
**
********************************** N O D E S **********************************
*NODE, NSET=ALLNODES
**
********************************** E L E M E N T S ****************************
*ELEMENT, TYPE=C3D8R, ELSET=brain
*ELEMENT, TYPE=C3D8R, ELSET=catheder
*ELEMENT, TYPE=C3D8R, ELSET=laserTip
**
********************************** N O D E S E T S **********************************
*NSET, NSET=dirichlet
*NSET, NSET=appboundarynode
**
********************************** S I D E S E T S **********************************
*ELSET, ELSET=cauchy_S1
*ELSET, ELSET=cauchy_S2
*ELSET, ELSET=cauchy_S3
*ELSET, ELSET=cauchy_S4
*ELSET, ELSET=cauchy_S5
*ELSET, ELSET=cauchy_S6
*SURFACE, NAME=cauchy
cauchy_S1, S1
cauchy_S2, S2
cauchy_S3, S3
cauchy_S4, S4
cauchy_S5, S5
cauchy_S6, S6
**
********************************** P R O P E R T I E S ************************
*SOLID SECTION, ELSET=brain, MATERIAL=Default-Steel
*SOLID SECTION, ELSET=catheder, MATERIAL=Default-Steel
*SOLID SECTION, ELSET=laserTip, MATERIAL=Default-Steel
**
*END PART
**
**
**
********************************** E N D   P A R T S **********************************
**
**
********************************** A S S E M B L Y ************************************
**
*ASSEMBLY, NAME=ASSEMBLY1
**
*INSTANCE, NAME=Part-Default_1, PART=Part-Default
*END INSTANCE
**
*END ASSEMBLY
**
**
**
*MATERIAL, NAME = Default-Steel
*ELASTIC, TYPE=ISOTROPIC
2.068000e+05, 2.900000e-01
*DENSITY
7.000000e-06
*CONDUCTIVITY,TYPE=ISO
4.500000e-02
*SPECIFIC HEAT
5.000000e+02
**
**
************************************** H I S T O R Y *************************************
**
*PREPRINT
**
**************************************** S T E P 1 ***************************************
*STEP,INC=100,NAME=Default Set
**
*STATIC
1, 1, 1e-05, 1
**
**
**
*END STEP